>source

나는 복제했다 펄럭이있는 repo.그리고 설치를 설치했습니다 안드로이드 SDK 명령 줄 도구, 그들을 설정하십시오$ 홈 /안드로이드...에 나는 그 다음으로 만들었습니다실룩 거리다그를 알고있다SDK.설정에 의한 설치$ android_home....에$ 홈 /안드로이드...에 상황은 일해 보이는 것처럼 보입니다< 경로 -펄터 > 박사님발견

  • ​​Android SDK
  • My Java JDK 8 설치 (OpenJDK-8-JDK.패키지 on.우분투 18.04.) 및
  • USB 디버깅이있는 연결된 Android 휴대 전화

이제는 다음을 따르려고합니다. 테스트 실행 지침명령 줄에 첫 번째 앱을 작성하는 것입니다.< 경로 -펄터 > myApp을 만듭니다A.를 일으키고 생산합니다myApp.예배 규칙서. 그런 다음 결과 스타터 앱을 실행하려고합니다.

cd myapp
~/myapp$ ANDROID_HOME=~/Android JAVA_HOME=/usr/lib/jvm/java-1.8.0-openjdk-amd64 <path-to-flutter> run

다음 오류가 발생합니다.

Launching lib/main.dart on ONEPLUS A6013 in debug mode...
FAILURE: Build failed with an exception.
* What went wrong:
Execution failed for task ':app:compileDebugKotlin'.
> Kotlin could not find the required JDK tools in the Java installation '/usr/lib/jvm/java-8-openjdk-amd64/jre' used by Gradle. Make sure Gradle is running on a JDK, not JRE.
* Try:
Run with --stacktrace option to get the stack trace. Run with --info or --debug option to get more log output. Run with --scan to get full insights.
* Get more help at https://help.gradle.org
BUILD FAILED in 10s
Running Gradle task 'assembleDebug'...
Running Gradle task 'assembleDebug'... Done                        11.0s
Exception: Gradle task assembleDebug failed with exit code 1

이 문제를 보았습니다. 논의 된 것그러나 해당 답장 중 어느 것도 그것을 해결하는 것처럼 보입니다 (적어도 내 경우). 오른쪽을 내보낼 명령에서 볼 수 있습니다.$ java_home.그리고 게다가, 달리기

./android/gradlew build

내부에서myApp.디렉토리가 작동합니다.

~/myapp$ ./android/gradlew build
> Task :buildEnvironment
------------------------------------------------------------
Root project
------------------------------------------------------------
classpath
No dependencies
A web-based, searchable dependency report is available by adding the --scan option.
BUILD SUCCESSFUL in 319ms
1 actionable task: 1 executed

그래서 이것은 특정 것처럼 보입니다.실룩 거리다그 자체가 어쨌든, 오히려졸업자...에

  • 이전 상태 표시 줄과 탐색 막대는 동일한 색상 iOS Swift를 가진 것 같습니다.
  • 다음 SQL Server에서 사용하거나 조건하지 않고 특정 레code를 선택하는 방법